{"text_format":"1","workbook":"xlsx","n_sheets":10,"sheets":["meta","Database","Encoding","PART 1 - Proficient","PART 1 - Highly Proficient","PART 2","PART 3","PART 4","divisions","rating"],"not_rendered":{"charts":0,"images":1,"macros":1,"external_links":0,"defined_names":65,"comments":0,"pivot_tables":0},"unopened":[],"bounds":{"document_bytes":16777216,"sheet_cells":100000,"rows_first":2000,"rows_last":500,"rows_between":2000,"halvings":0,"cell_chars":16384,"cell_head_chars":4096},"cells_cut":0,"cells_raw":0,"read":"whole","date_system":"1900"}

{"sheet":"meta","index":0,"n_rows":22,"n_cols":3,"rows_kept":22,"cut":false,"hidden":true,"merged":[]}
["property","value","value2"]
["consolidation_status",false]
["encoding_status",true,true]
["save_status",false,false]
["change_status",false,false]
["lock_password"]
["doc_type","IPCRF encoding"]
["version",2.1]
{"$rows_left_out":15}
{"sheet":"Database","index":1,"n_rows":2,"n_cols":207,"rows_kept":2,"cut":false,"hidden":true,"merged":[]}
["division","school_id","school_name","school_classification","rater","rater_position","date_of_review","rating_period","proficiency","name","position","teacher_id","subject_area","grade_level","COT1_subject","COT1_1","COT1_2","COT1_3","COT1_4","COT1_5","COT1_6","COT1_7","COT1_8","COT1_9","COT1_10","COT1_11","COT1_12","COT1_13","COT1_date","COT2_subject","COT2_1","COT2_2","COT2_3","COT2_4","COT2_5","COT2_6","COT2_7","COT2_8","COT2_9","COT2_10","COT2_11","COT2_12","COT2_13","COT2_date","COT3_subject","COT3_1","COT3_2","COT3_3","COT3_4","COT3_5","COT3_6","COT3_7","COT3_8","COT3_9","COT3_10","COT3_11","COT3_12","COT3_13","COT3_date","COT4_subject","COT4_1","COT4_2","COT4_3","COT4_4","COT4_5","COT4_6","COT4_7","COT4_8","COT4_9","COT4_10","COT4_11","COT4_12","COT4_13","COT4_date","COT_ave_1","COT_ave_2","COT_ave_3","COT_ave_4","COT_ave_5","COT_ave_6","COT_ave_7","COT_ave_8","COT_ave_9","COT_ave_10","COT_ave_11","COT_ave_12","COT_ave_13","Objective1Q","Objective1E","Objective1T","Objective2Q","Objective2E","Objective2T","Objective3Q","Objective3E","Objective3T","Objective4Q","Objective4E","Objective4T","Objective5Q","Objective5E","Objective5T","Objective6Q","Objective6E","Objective6T","Objective7Q","Objective7E","Objective7T","Objective8Q","Objective8E","Objective8T","Objective9Q","Objective9E","Objective9T","Objective10Q","Objective10E","Objective10T","Objective11Q","Objective11E","Objective11T","Objective12Q","Objective12E","Objective12T","Objective13Q","Objective13E","Objective13T","approving_authority","approving_authority_position","self_management_1","self_management_2","self_management_3","self_management_4","self_management_5","PE1","PE2","PE3","PE4","PE5","results_focus1","results_focus2","results_focus3","results_focus4","results_focus5","teamwork1","teamwork2","teamwork3","teamwork4","teamwork5","service_orientation1","service_orientation2","service_orientation3","service_orientation4","service_orientation5","innovation1","innovation2","innovation3","innovation4","innovation5","Part1_date_finalized","Part2_date_finalized","Objective1AVE","Objective1Score","Objective2AVE","Objective2Score","Objective3AVE","Objective3Score","Objective4AVE","Objective4Score","Objective5AVE","Objective5Score","Objective6AVE","Objective6Score","Objective7AVE","Objective7Score","Objective8AVE","Objective8Score","Objective9AVE","Objective9Score","Objective10AVE","Objective10Score","Objective11AVE","Objective11Score","Objective12AVE","Objective12Score","Objective13AVE","Objective13Score","RATING","Adjectival_rating","self_management","PE","results_focus","teamwork","service_orientation","innovation","Region","municipality","school_type","school_size","curricular_classification","employment_status","age","sex","level_taught","years_in_teaching","highest_degree","degree","specialization"]
[null,null,null,null,null,null,null,null,null,null,null,null,null,null,null,null,null,null,null,null,null,null,null,null,null,null,null,null,null,null,null,null,null,null,null,null,null,null,null,null,null,null,null,null,null,null,null,null,null,null,null,null,null,null,null,null,null,null,null,null,null,null,null,null,null,null,null,null,null,null,null,null,null,null,null,null,null,null,null,null,null,null,null,null,null,null,null,null,null,null,null,null,null,null,null,null,null,null,null,null,null,null,null,null,null,null,null,null,null,null,null,null,null,null,null,null,null,null,null,null,null,null,null,null,null,null,null,null,null,null,null,null,null,null,null,null,null,null,null,null,null,null,null,null,null,null,null,null,null,null,null,null,null,null,null,null,null,null,null,null,{"$f":"IFERROR(AVERAGE(database[[#This Row],[Objective1Q]:[Objective1T]]),0)","v":0},{"$f":"ROUNDDOWN(database[[#This Row],[Objective1AVE]]*7.5%, 3)","v":0},{"$f":"IFERROR(AVERAGE(database[[#This Row],[Objective2Q]:[Objective2T]]),0)","v":0},{"$f":"ROUNDDOWN(database[[#This Row],[Objective2AVE]]*7.5%, 3)","v":0},{"$f":"IFERROR(AVERAGE(database[[#This Row],[Objective3Q]:[Objective3T]]),0)","v":0},{"$f":"ROUNDDOWN(database[[#This Row],[Objective3AVE]]*7.5%,3)","v":0},{"$f":"IFERROR(AVERAGE(database[[#This Row],[Objective4Q]:[Objective4T]]),0)","v":0},{"$f":"ROUNDDOWN(database[[#This Row],[Objective4AVE]]*7.5%, 3)","v":0},{"$f":"IFERROR(AVERAGE(database[[#This Row],[Objective5Q]:[Objective5T]]),0)","v":0},{"$f":"ROUNDDOWN(database[[#This Row],[Objective5AVE]]*7.5%, 3)","v":0},{"$f":"IFERROR(AVERAGE(database[[#This Row],[Objective6Q]:[Objective6T]]),0)","v":0},{"$f":"ROUNDDOWN(database[[#This Row],[Objective6AVE]]*7.5%, 3)","v":0},{"$f":"IFERROR(AVERAGE(database[[#This Row],[Objective7Q]:[Objective7T]]),0)","v":0},{"$f":"ROUNDDOWN(database[[#This Row],[Objective7AVE]]*7.5%, 3)","v":0},{"$f":"IFERROR(AVERAGE(database[[#This Row],[Objective8Q]:[Objective8T]]),0)","v":0},{"$f":"ROUNDDOWN(database[[#This Row],[Objective8AVE]]*7.5%, 3)","v":0},{"$f":"IFERROR(AVERAGE(database[[#This Row],[Objective9Q]:[Objective9T]]),0)","v":0},{"$f":"ROUNDDOWN(database[[#This Row],[Objective9AVE]]*7.5%, 3)","v":0},{"$f":"IFERROR(AVERAGE(database[[#This Row],[Objective10Q]:[Objective10T]]),0)","v":0},{"$f":"ROUNDDOWN(database[[#This Row],[Objective10AVE]]*7.5%, 3)","v":0},{"$f":"IFERROR(AVERAGE(database[[#This Row],[Objective11Q]:[Objective11T]]),0)","v":0},{"$f":"ROUNDDOWN(database[[#This Row],[Objective11AVE]]*7.5%, 3)","v":0},{"$f":"IFERROR(AVERAGE(database[[#This Row],[Objective12Q]:[Objective12T]]),0)","v":0},{"$f":"ROUNDDOWN(database[[#This Row],[Objective12AVE]]*7.5%, 3)","v":0},{"$f":"IFERROR(AVERAGE(database[[#This Row],[Objective13Q]:[Objective13T]]),0)","v":0},{"$f":"ROUNDDOWN(database[[#This Row],[Objective13AVE]]*10%, 3)","v":0},{"$f":"SUM(database[[#This Row],[Objective1Score]],database[[#This Row],[Objective2Score]],database[[#This Row],[Objective3Score]],database[[#This Row],[Objective4Score]],database[[#This Row],[Objective5Score]],database[[#This Row],[Objective6Score]],database[[#This Row],[Objective7Score]],database[[#This Row],[Objective8Score]],database[[#This Row],[Objective9Score]],database[[#This Row],[Objective10Score]],database[[#This Row],[Objective11Score]],database[[#This Row],[Objective12Score]],database[[#This Row],[Objective13Score]])","v":0},{"$f":"IF(database[[#This Row],[RATING]]<1.499,\"Poor\",IF(database[[#This Row],[RATING]]<=2.499,\"Unsatisfactory\",IF(database[[#This Row],[RATING]]<=3.499,\"Satisfactory\",IF(database[[#This Row],[RATING]]<=4.499,\"Very Satisfactory\",IF(database[[#This Row],[RATING]]<=5,\"Outstanding\")))))","v":"Poor"},{"$f":"COUNTIF(database[[#This Row],[self_management_1]:[self_management_5]],TRUE)","v":0},{"$f":"COUNTIF(database[[#This Row],[PE1]:[PE5]],TRUE)","v":0},{"$f":"COUNTIF(database[[#This Row],[results_focus1]:[results_focus5]],TRUE)","v":0},{"$f":"COUNTIF(database[[#This Row],[teamwork1]:[teamwork5]],TRUE)","v":0},{"$f":"COUNTIF(database[[#This Row],[service_orientation1]:[service_orientation5]],TRUE)","v":0},{"$f":"COUNTIF(database[[#This Row],[innovation1]:[innovation5]],TRUE)","v":0}]

{"sheet":"Encoding","index":2,"n_rows":91,"n_cols":24,"rows_kept":91,"cut":false,"hidden":false,"merged":[[12,20,14,20],[28,19,28,20],[54,3,54,10],[43,3,43,10],[44,3,44,10],[39,2,39,10],[46,2,46,10],[47,3,47,10],[40,3,40,10],[41,3,41,10],[42,3,42,10],[12,19,14,19],[12,15,13,18],[12,2,14,2],[44,13,44,20],[28,14,28,18],[29,1,29,5],[29,6,29,7],[29,8,29,9],[29,10,29,11],[29,12,29,13],[33,4,33,8],[34,4,34,8],[33,0,33,3],[58,13,58,20],[53,12,53,20],[29,19,29,20],[39,12,39,20],[40,13,40,20],[41,13,41,20],[42,13,42,20],[43,13,43,20],[47,13,47,20],[29,14,29,18],[34,9,34,12],[55,3,55,10],[56,3,56,10],[57,3,57,10],[58,3,58,10],[48,3,48,10],[49,3,49,10],[50,3,50,10],[51,3,51,10],[53,2,53,10],[48,13,48,20],[46,12,46,20],[49,13,49,20],[50,13,50,20],[55,13,55,20],[56,13,56,20],[57,13,57,20],[51,13,51,20],[54,13,54,20],[38,2,38,20],[4,9,4,13],[5,9,5,13],[6,7,6,8],[12,14,14,14],[13,8,13,9],[13,10,13,11],[10,10,10,13],[6,14,6,16],[11,14,11,16],[11,17,11,20],[6,9,6,13],[34,0,34,3],[12,10,12,11],[12,12,12,13],[13,12,13,13],[10,1,10,2],[10,3,10,6],[8,1,8,2],[6,3,6,6],[11,3,11,6],[18,1,20,1],[12,3,14,3],[12,4,14,4],[13,6,13,7],[15,1,17,1],[12,1,14,1],[9,1,9,2],[9,3,9,6],[11,7,11,9],[6,1,6,2],[12,6,12,7],[12,8,12,9],[11,1,11,2],[7,3,7,6],[8,3,8,6],[8,7,8,9],[9,7,10,9],[7,1,7,2],[12,5,14,5],[0,0,0,20],[1,0,1,20],[3,1,3,2],[4,1,4,2],[5,1,5,2],[3,3,3,6],[4,3,4,6],[5,3,5,6],[2,0,2,20],[3,7,3,8],[4,7,4,8],[5,7,5,8],[3,14,3,16],[3,17,3,20],[4,14,4,16],[4,17,4,20],[5,14,5,16],[5,17,5,20],[3,9,3,13],[33,9,33,12],[28,1,28,5],[28,6,28,7],[28,8,28,9],[28,10,28,11],[28,12,28,13],[21,1,23,1],[24,1,26,1],[15,2,17,2],[18,2,20,2],[21,2,23,2],[24,2,26,2],[11,10,11,13],[10,17,10,20],[7,7,7,9],[8,10,8,13],[9,10,9,13],[7,10,7,13],[6,17,6,20],[7,14,7,16],[7,17,7,20],[8,14,8,16],[8,17,8,20],[9,14,9,16],[9,17,9,20],[10,14,10,16]]}
["IPCRF Rating Encoding Form"]
[{"$f":"IF($X$4=\"P\",\"Teacher I-III, SPET I-IV (Proficient Teacher)\",\"Master Teacher I-IV, SPET V (Highly Proficient Teacher)\")","v":"Teacher I-III, SPET I-IV (Proficient Teacher)"}]
["PART 1: INDIVIDUAL PERFORMANCE COMMITMENT AND REVIEW FORM"]
[null,"Name of Employee:",null,null,null,null,null,"Rater:",null,null,null,null,null,null,"Region:",null,null,null,null,null,null,null,null,{"$f":"IF(OR($D$5=\"SPET V\",$D$5=\"Master Teacher I\", $D$5=\"Master Teacher II\", $D$5=\"Master Teacher III\", $D$5=\"Master Teacher IV\",$D$5=\"Special Science Teacher III\",$D$5=\"Special Science Teacher IV\",$D$5=\"Special Science Teacher V\"),\"HP\",\"P\")","v":"P"}]
[null,"Position:",null,null,null,null,null,"Position:",null,null,null,null,null,null,"Division:"]
[null,"Employee ID #:",null,null,null,null,null,"Date of Review:",null,null,null,null,null,null,"District/Municipality:"]
[null,"Employment Status:",null,null,null,null,null,"Rating Period:",null,"SY 2019-2020",null,null,null,null,"School ID:"]
[null,"Age:",null,null,null,null,null,null,null,null,null,null,null,null,"School Name:"]
{"$rows_left_out":84}
{"sheet":"PART 1 - Proficient","index":3,"n_rows":64,"n_cols":18,"rows_kept":64,"cut":false,"hidden":false,"merged":[[3,0,3,2],[3,3,3,8],[3,9,3,10],[3,11,3,16],[4,0,4,2],[4,3,4,8],[4,9,4,16],[0,0,0,16],[1,0,1,2],[1,3,1,8],[1,9,1,10],[1,11,1,16],[2,0,2,2],[2,3,2,8],[2,9,2,10],[2,11,2,16],[7,0,7,10],[7,11,7,16],[8,0,10,0],[8,1,10,1],[8,2,10,2],[8,3,10,3],[8,4,10,4],[8,5,8,10],[8,11,10,11],[8,12,9,15],[11,14,13,14],[11,15,13,15],[11,16,13,16],[11,12,13,12],[11,13,13,13],[8,16,10,16],[9,5,10,5],[11,2,13,2],[11,3,13,3],[17,14,19,14],[17,15,19,15],[17,16,19,16],[17,12,19,12],[17,13,19,13],[17,2,19,2],[17,3,19,3],[14,12,16,12],[14,13,16,13],[14,14,16,14],[14,15,16,15],[14,16,16,16],[14,3,16,3],[14,2,16,2],[20,1,28,1],[23,16,25,16],[23,12,25,12],[23,13,25,13],[23,14,25,14],[23,15,25,15],[23,3,25,3],[20,12,22,12],[20,13,22,13],[20,14,22,14],[20,15,22,15],[20,16,22,16],[26,12,28,12],[26,13,28,13],[26,14,28,14],[26,15,28,15],[26,16,28,16],[26,2,28,2],[26,3,28,3],[26,4,28,4],[20,2,22,2],[20,3,22,3],[20,4,25,4],[23,2,25,2],[29,15,31,15],[29,16,31,16],[29,2,31,2],[29,3,31,3],[29,4,31,4],[29,12,31,12],[29,13,31,13],[29,14,31,14],[29,1,37,1],[32,15,34,15],[32,16,34,16],[35,2,37,2],[35,3,37,3],[35,12,37,12],[35,13,37,13],[35,14,37,14],[35,15,37,15],[35,16,37,16],[32,2,34,2],[32,3,34,3],[32,4,37,4],[32,12,34,12],[32,13,34,13],[32,14,34,14],[38,1,46,1],[41,14,43,14],[41,15,43,15],[41,16,43,16],[41,12,43,12],[41,13,43,13],[38,13,40,13],[38,14,40,14],[38,15,40,15],[38,16,40,16],[44,12,46,12],[44,13,46,13],[44,14,46,14],[44,15,46,15],[44,16,46,16],[44,2,46,2],[44,3,46,3],[44,4,46,4],[41,2,43,2],[41,3,43,3],[38,2,40,2],[38,3,40,3],[38,4,43,4],[38,12,40,12],[47,14,49,14],[47,15,49,15],[47,16,49,16],[50,12,50,15],[47,1,49,1],[47,2,49,2],[47,3,49,3],[47,4,49,4],[50,9,50,11],[11,1,19,1],[11,4,19,4],[11,0,49,0],[62,1,62,4],[62,6,62,8],[62,10,62,14],[63,1,63,4],[63,6,63,8],[63,10,63,14],[55,0,55,1],[55,2,55,5],[56,0,56,1],[56,2,56,5],[57,0,57,1],[57,2,57,5],[51,0,51,5],[52,0,52,1],[52,2,52,5],[53,0,53,1],[53,2,53,5],[54,0,54,1],[54,2,54,5],[47,12,49,12],[47,13,49,13]]}
["INDIVIDUAL PERFORMANCE COMMITMENT AND REVIEW FORM (IPCRF) for Teacher I-III, SPET I-IV, Special Science Teacher I-II",null,null,null,null,null,null,null,null,null,null,null,null,null,null,null,null,"P"]
["Name of Employee:",null,null,{"$f":"IF(database[name]=\"\",\"\",database[name])","v":""},null,null,null,null,null,"Name of Rater:",null,{"$f":"IF(database[rater]=\"\",\"\",database[rater])","v":""}]
["Position:",null,null,{"$f":"IF(database[position]=\"\",\"\",database[position])","v":""},null,null,null,null,null,"Position:",null,{"$f":"IF(database[rater_position]=\"\",\"\",database[rater_position])","v":""}]
["Bureau/Center/Service/Division:",null,null,{"$f":"(database[school_name] & \" - \" & database[division])","v":" - "},null,null,null,null,null,"Date of Review:",null,{"$f":"IF(database[date_of_review]=\"\",\"\",database[date_of_review])","v":""}]
["Rating Period:",null,null,{"$f":"IF(database[rating_period]=\"\",\"\",database[rating_period])","v":""}]
[]
[]
["TO BE FILLED OUT DURING PLANNING ",null,null,null,null,null,null,null,null,null,null,"TO BE FILLED OUT DURING EVALUATION"]
{"$rows_left_out":57}
{"sheet":"PART 1 - Highly Proficient","index":4,"n_rows":66,"n_cols":18,"rows_kept":66,"cut":false,"hidden":true,"merged":[[38,1,46,1],[64,11,64,16],[65,1,65,4],[65,7,65,9],[65,11,65,16],[11,0,49,0],[29,1,37,1],[20,1,28,1],[11,1,19,1],[50,9,50,11],[58,0,58,1],[58,2,58,5],[59,0,59,1],[59,2,59,5],[64,1,64,4],[64,7,64,9],[55,0,55,1],[55,2,55,5],[56,0,56,1],[56,2,56,5],[57,0,57,1],[57,2,57,5],[47,15,49,15],[47,16,49,16],[50,12,50,15],[53,0,53,5],[54,0,54,1],[54,2,54,5],[47,1,49,1],[47,2,49,2],[47,3,49,3],[47,4,49,4],[47,12,49,12],[47,13,49,13],[47,14,49,14],[44,15,46,15],[44,16,46,16],[41,14,43,14],[41,15,43,15],[41,16,43,16],[44,2,46,2],[44,3,46,3],[44,12,46,12],[44,13,46,13],[44,14,46,14],[41,12,43,12],[41,13,43,13],[38,4,46,4],[41,2,43,2],[41,3,43,3],[38,15,40,15],[38,16,40,16],[35,15,37,15],[35,16,37,16],[38,2,40,2],[38,3,40,3],[38,12,40,12],[38,13,40,13],[38,14,40,14],[35,2,37,2],[35,3,37,3],[35,12,37,12],[35,13,37,13],[35,14,37,14],[29,4,37,4],[32,15,34,15],[32,16,34,16],[29,13,31,13],[29,14,31,14],[29,15,31,15],[29,16,31,16],[32,2,34,2],[32,3,34,3],[32,12,34,12],[32,13,34,13],[32,14,34,14],[29,2,31,2],[29,3,31,3],[29,12,31,12],[23,2,25,2],[23,3,25,3],[26,2,28,2],[20,14,22,14],[20,15,22,15],[20,16,22,16],[20,12,22,12],[20,13,22,13],[20,2,22,2],[20,3,22,3],[26,16,28,16],[26,12,28,12],[26,13,28,13],[26,14,28,14],[26,15,28,15],[26,3,28,3],[23,12,25,12],[23,13,25,13],[23,14,25,14],[23,15,25,15],[23,16,25,16],[20,4,28,4],[17,12,19,12],[17,13,19,13],[17,14,19,14],[17,15,19,15],[17,16,19,16],[17,2,19,2],[17,3,19,3],[14,14,16,14],[14,15,16,15],[14,16,16,16],[14,12,16,12],[14,13,16,13],[11,4,19,4],[11,14,13,14],[11,15,13,15],[11,16,13,16],[14,2,16,2],[14,3,16,3],[11,12,13,12],[11,13,13,13],[8,16,10,16],[9,5,10,5],[11,2,13,2],[11,3,13,3],[7,0,7,10],[7,11,7,16],[8,0,10,0],[8,1,10,1],[8,2,10,2],[8,3,10,3],[8,4,10,4],[8,5,8,10],[8,11,10,11],[8,12,9,15],[3,0,3,2],[3,3,3,7],[3,8,3,9],[3,10,3,16],[4,0,4,2],[4,3,4,7],[4,8,4,16],[0,0,0,16],[1,0,1,2],[1,3,1,7],[1,8,1,9],[1,10,1,16],[2,0,2,2],[2,3,2,7],[2,8,2,9],[2,10,2,16]]}
["INDIVIDUAL PERFORMANCE COMMITMENT AND REVIEW FORM (IPCRF) for Master Teacher I-IV, SPET V, SPECIAL SCIENCE TEACHER III-V",null,null,null,null,null,null,null,null,null,null,null,null,null,null,null,null,"HP"]
["Name of Employee:",null,null,{"$f":"IF(database[name]=\"\",\"\",database[name])","v":""},null,null,null,null,"Name of Rater:",null,{"$f":"IF(database[rater]=\"\",\"\",database[rater])","v":""}]
["Position:",null,null,{"$f":"IF(database[position]=\"\",\"\",database[position])","v":""},null,null,null,null,"Position:",null,{"$f":"IF(database[rater_position]=\"\",\"\",database[rater_position])","v":""}]
["Bureau/Center/Service/Division:",null,null,{"$f":"(database[school_name] & \" - \" & database[division])","v":" - "},null,null,null,null,"Date of Review:",null,{"$f":"IF(database[date_of_review]=\"\",\"\",database[date_of_review])","v":""}]
["Rating Period:",null,null,{"$f":"IF(database[rating_period]=\"\",\"\",database[rating_period])","v":""}]
[]
[]
["TO BE FILLED OUT DURING PLANNING ",null,null,null,null,null,null,null,null,null,null,"TO BE FILLED OUT DURING EVALUATION"]
{"$rows_left_out":59}
{"sheet":"PART 2","index":5,"n_rows":22,"n_cols":4,"rows_kept":22,"cut":false,"hidden":false,"merged":[[15,1,20,1],[15,3,20,3],[21,0,21,3],[0,0,0,3],[1,0,1,3],[2,0,2,3],[3,1,8,1],[3,3,8,3],[9,1,14,1],[9,3,14,3]]}
["PART II: COMPETENCIES"]
["Instructions: Please indicate the number of competency indicators that you demonstrated during the performance cycle. "]
["CORE BEHAVIORAL COMPETENCIES"]
["Self-Management",{"$f":"database[self_management]","v":0},"Teamwork",{"$f":"database[teamwork]","v":0}]
["1. Sets personal goals and directions, needs and development.",null,"1. Willingly does his/her share of responsibility."]
["2. Undertakes personal actions and behavior that are clear and purposive and takes into account personal goals and values congruent to that of the organization.",null,"2. Promotes collaboration and removes barrier to teamwork and goal accomplishment across the organization."]
["3. Displays emotional maturity and enthusiasm for and is challenged by higher goals.",null,"3. Applies negotiation principles in arriving at win-win agreements."]
["4. Prioritizes work tasks and schedules (through Gantt chants, checklists, etc.) to achieve goals.",null,"4. Drives consensus and team ownership of decisions."]
{"$rows_left_out":15}
{"sheet":"PART 3","index":6,"n_rows":31,"n_cols":11,"rows_kept":31,"cut":false,"hidden":false,"merged":[[24,3,25,6],[17,1,19,1],[17,2,19,2],[29,8,29,11],[29,0,29,2],[0,0,0,11],[1,0,1,11],[9,10,10,10],[24,9,24,10],[25,9,25,10],[3,8,3,10],[4,8,4,10],[5,8,5,10],[6,6,6,10],[8,1,8,10],[20,1,22,1],[20,2,22,2],[9,9,10,9],[3,1,3,2],[3,3,3,5],[24,1,25,2],[3,6,3,7],[4,1,4,2],[4,3,4,5],[9,1,10,1],[9,2,10,2],[9,3,10,3],[9,4,10,4],[9,5,9,8],[30,0,30,2],[29,3,29,7],[30,3,30,7],[4,6,4,7],[5,6,5,7],[5,1,5,2],[5,3,5,5],[6,1,6,2],[6,3,6,5],[24,7,24,8],[25,7,25,8],[11,1,13,1],[11,2,13,2],[14,1,16,1],[14,2,16,2],[30,8,30,11]]}
["INDIVIDUAL PERFORMANCE COMMITMENT AND REVIEW FORM (IPCRF) SUMMARY SHEET"]
[{"$f":"IF(OR(Database!I2=\"P\",Database!I2=\"\"),\"Teacher I-III, SPET I-IV, Special Science Teacher I-II (Proficient Teacher)\", \"Master Teacher I-IV, SPET V, Special Science Teacher III-V (Highly Proficient Teacher)\")","v":"Teacher I-III, SPET I-IV, Special Science Teacher I-II (Proficient Teacher)"}]
[]
[null,"Name of Employee:",null,{"$f":"IF(database[name]=\"\",\"\",database[name])","v":""},null,null,"Name of Rater:",null,{"$f":"IF(database[rater]=\"\",\"\",database[rater])","v":""}]
[null,"Position:",null,{"$f":"IF(database[position]=\"\",\"\",database[position])","v":""},null,null,"Position:",null,{"$f":"IF(database[rater_position]=\"\",\"\",database[rater_position])","v":""}]
[null,"Bureau/Center/Service/Division:",null,{"$f":"(database[school_name] & \" - \" & database[division])","v":" - "},null,null,"Date of Review:",null,{"$f":"IF(database[date_of_review]=\"\",\"\",database[date_of_review])","v":""}]
[null,"Rating Period:",null,{"$f":"IF(database[rating_period]=\"\",\"\",database[rating_period])","v":""}]
[]
{"$rows_left_out":24}
{"sheet":"PART 4","index":7,"n_rows":33,"n_cols":6,"rows_kept":33,"cut":false,"hidden":false,"merged":[[5,0,5,5],[32,0,32,1],[32,2,32,3],[32,4,32,5],[15,0,15,5],[31,0,31,1],[31,2,31,3],[31,4,31,5],[26,0,30,5],[0,0,0,5],[2,0,4,0],[2,1,4,1],[2,2,2,3],[2,4,4,4],[2,5,4,5],[3,2,3,3]]}
["PART IV: DEVELOPMENT PLANS"]
[]
["Strengths","Development Needs","Action Plan",null,"Timeline","Resources Needed"]
[null,null,"(Recommended Developmental Intervention)"]
[null,null,"Learning Objectives","Intervention"]
["A. Functional Competencies"]
[]
[]
{"$rows_left_out":26}
{"sheet":"divisions","index":8,"n_rows":224,"n_cols":15,"rows_kept":224,"cut":false,"hidden":true,"merged":[]}
["Region","Division"]
["BARMM","Basilan",null,null,null,"Bangsamoro Autonomous Region in Muslim Mindanao (BARMM)","BARMM_divlist",null,{"$f":"IFERROR(VLOOKUP(Encoding!$R$4,divisions!$F$2:$G$18,2,0),\"\")","v":""},null,"Kindergarten","Kindergarten",null,"Kindergarten","Class1"]
["BARMM","Lamitan City",null,null,null,"Cordillera Administrative Region (CAR)","CAR_divlist",null,null,null,"Kinder to Grade 6","Kindergarten",null,"Kinder to Grade 6","Class2"]
["BARMM","Lanao del Sur I",null,null,null,"National Capital Region (NCR)","NCR_divlist",null,null,null,"Kinder to Grade 6","Elementary",null,"Kinder to Grade 10","Class3"]
["BARMM","Lanao del Sur II",null,null,null,"I - Ilocos Region","RI_divlist",null,null,null,"Kinder to Grade 10","Kindergarten",null,"Kinder to Grade 12","Class4"]
["BARMM","Maguindanao I",null,null,null,"II - Cagayan Valley","RII_divlist",null,null,null,"Kinder to Grade 10","Elementary",null,"Kinder to Grade 6; Grade 11-12","Class5"]
["BARMM","Maguindanao II",null,null,null,"III - Central Luzon","RIII_divlist",null,null,null,"Kinder to Grade 10","Junior High School",null,"Kinder to Grade 10 attached to Tertiary","Class6"]
["BARMM","Marawi City",null,null,null,"IV-A - CALABARZON","RIVA_divlist",null,null,null,"Kinder to Grade 12","Kindergarten",null,"Kinder to Grade 12 attached to Tertiary","Class7"]
{"$rows_left_out":217}
{"sheet":"rating","index":9,"n_rows":32,"n_cols":35,"rows_kept":32,"cut":false,"hidden":true,"merged":[]}
["MT",null,null,"classification",null,"raters",null,null,"subjects",null,"grade level",null,"position",null,"Region",null,null,null,null,"age",null,"Employment Status",null,"Total Number of Years in Teaching",null,null,"Highest Degree Obtained",null,null,"Curricular Classification",null,null,"Sex",null,"Specialization"]
[8,5,null,"Elementary",null,"Schools Division Superintendent",null,null,"All Subjects",null,"Kindergarten",null,"Teacher I",null,"National Capital Region (NCR)",null,null,null,null,"Under 25 years old",null,"Regular Permanent",null,"0-3 years",null,null,"Bachelor's Degree",null,null,"Kindergarten",null,null,"Male",null,"English"]
[7,4,null,"Junior High School",null,"Assistant Schools Division Superintendent",null,null,"MTB-MLE",null,"Grade 1",null,"Teacher II",null,"Cordillera Administrative Region (CAR)",null,null,null,null,"25-30",null,"Provisional",null,"4-10 years",null,null,"Master's Degree",null,null,"Kinder to Grade 6",null,null,"Female",null,"Filipino"]
[6,3,null,"Senior High School",null,"CID Chief",null,null,"Madrasah ALIVE",null,"Grade 2",null,"Teacher III",null,"I - Ilocos Region",null,null,null,null,"31-35",null,"Substitute",null,"More than 10 years",null,null,"Doctorate Degree",null,null,"Kinder to Grade 10",null,null,null,null,"Mathematics"]
[5,2,null,null,null,"Education Program Supervisor",null,null,"Filipino",null,"Grade 3",null,"SPET I",null,"II - Cagayan Valley",null,null,null,null,"36-40",null,"Contractual",null,null,null,null,null,null,null,"Kinder to Grade 12",null,null,null,null,"General Science"]
[4,1,null,null,null,"Public Schools District Supervisor",null,null,"English",null,"Grade 4",null,"SPET II",null,"III - Central Luzon",null,null,null,null,"41-45",null,null,null,null,null,null,null,null,null,"Kinder to Grade 6; Grade 11-12",null,null,null,null,"Biology"]
[null,null,null,null,null,"Principal IV",null,null,"Mathematics",null,"Grade 5",null,"SPET III",null,"IV-A - CALABARZON",null,null,null,null,"46-50",null,null,null,null,null,null,null,null,null,"Kinder to Grade 10 attached to Tertiary",null,null,null,null,"Chemistry"]
[null,null,null,"level taught",null,"Principal III",null,null,"Science",null,"Grade 6",null,"SPET IV",null,"IV-B - MIMAROPA",null,null,null,null,"51-55",null,null,null,"School Type",null,"School Size",null,null,null,"Kinder to Grade 12 attached to Tertiary",null,null,null,null,"Physics"]
{"$rows_left_out":24}